Justice, Public Order, and Safety Activities Industry Industry
type: Class
alternative label: 司法、公共秩序和安全活动行业
subclass of: RC2P0YZS5Ku67wmSwN4OxWs
hidden label: JSAF
definition: This group includes government establishments engaged in the administration of justice, public order, and safety programs. Examples are: courts, police, legal counsel and prosecution, correctional institutions, parole and probation offices, and fire protection.