Sanskrit
type: Class
alternative label: 梵语
subclass of: RDOvAHsvY8TKJ1O1orXPM9o
definition: A classical language of India, Sanskrit is a member of the Indo-European language family and is known for its complex grammar and rich vocabulary.