Matter Narrative Audience
type: Class
subclass of: R7ReDY2v13rer1U8AyOj55L
definition: A Matter Narrative Audience is a group or individual for whom the factual and legal details of a matter are presented in a textual narrative.