Quid Pro Quo Sexual Harassment
type: Class
alternative label: 以权谋私性骚扰
subclass of: R8UY7a51FHRoPnKMKs41jQv
definition: The exchange of sexual favors for employment benefits or opportunities, which is a form of sexual harassment.