Test of Physical Evidence
type: Class
alternative label: 物证测试
subclass of: RChjSc2XuaDiZnlxpusNIxT
definition: A Test of Physical Evidence is a type of Physical Examination that involves analyzing and evaluating physical evidence to determine its properties and characteristics.