Accounting Claim
type: Class
alternative label: 会计索赔
subclass of: RZ1dOPJ6HH6lMJGSLNxfwV
definition: A claim for payment of a debt arising from an agreement or legal obligation related to financial records and transactions.