Indiana Circuit Court - Tippecanoe County
type: Class
subclass of: RCeiXNGpqL4H3jo1g1NobSm
definition: The Indiana Circuit Court - Tippecanoe County is a court of general jurisdiction in Indiana that hears civil and criminal cases within Tippecanoe County.