New York Supreme Court - Yates County
type: Class
subclass of: R06956a0657387D6513A8528
definition: The New York Supreme Court - Yates County is a court of general jurisdiction located in Yates County, New York, which is a subdivision of the New York Supreme Court.