state_province
type: Class
subclass of: RiYElk4o1PAzXUgf6xyizi
definition: "The state or province of parent. Required except in countries without an equivalent address component. Use accepted abbreviations mandated by the parent country's postal service. "