New York Surrogate Court
type: Class
subclass of: R3391bdB1A2adE51071C7cf7
definition: The New York Surrogate Court is a specialized court within the New York State Courts system that handles matters related to wills, estates, and trusts.