Tuvalu
type: Class
alternative label: 图瓦卢
subclass of: RDOvAHsvY8TKJ1O1orXPM9o
definition: Tuvalu (Language) is a structured system of communication that consists of grammar and vocabulary specific to the Tuvalu islands.