Structured Settlement
type: Class
alternative label: 结构化和解
subclass of: RBVGGEdVgHfVPEPq5dLPjrS
definition: A structured settlement is a type of settlement agreement that provides for periodic payments over time, rather than a lump sum payment.