Slander
type: Class
alternative label: 诽谤
subclass of: R7JKVOM2aFkvG1yiLzF7ndA
definition: The spoken or oral communication of false statements that harm the reputation of another person, which can result in legal action against the speaker.