Taken Into Custody
type: Class
alternative label: 被拘留
subclass of: RDBYmMtBs3jHkWCzKsvQP44
definition: Taken Into Custody: The act of a law enforcement officer taking a person into custody, typically for the purpose of charging them with a crime.