Probate due to Disability
type: Class
alternative label: 因残疾而产生的遗产管理
subclass of: RCZqMfCIxpgPzceI6IC42yK
definition: Probate due to Disability refers to the legal process of managing the assets and affairs of a person who is unable to do so themselves due to a physical or mental disability.