Federal Bureau of Investigation
type: Class
alternative label: 联邦调查局
subclass of: R0DB70442Cf8b73D9275F14a
hidden label: FBI
definition: The Federal Bureau of Investigation (FBI) is the domestic intelligence and security service of the United States, and its principal federal law enforcement agency.