Ladino
type: Class
alternative label: 拉迪诺语
subclass of: RDOvAHsvY8TKJ1O1orXPM9o
definition: A language derived from medieval Spanish and spoken by Sephardic Jews, primarily in Israel, Turkey, and the Balkans.