JL20 Support of advocates (UK J-CODE)
type: Class
subclass of: R7I4TyEe8IFvHxHnkfZXoVo
definition: Work by lawyers other than advocates relating to the above matters and all attendances at court on trial days including conferences or meetings before or after court and travel and waiting. Where there is a substantial gap between trial days, work should be allocated to whichever is the more appropriate of the Trial Preparation and Trial phases.