Choice of Venue Clause
type: Class
alternative label: 管辖地选择条款
subclass of: RDe0RKU39BlhcyACJW30ZLc
subclass of: RXDxuYOR20sbhobsDjIlcZ
definition: A Choice of Venue Clause is a provision in a contract that specifies the location or jurisdiction where any disputes arising from the contract will be resolved.