UK Serious Fraud Office
type: Class
alternative label: Fraud Office
alternative label: SFO
subclass of: R9AX4LAp7IfL4nFnLZeugyY
definition: The UK Serious Fraud Office is a governmental department responsible for investigating and prosecuting serious or complex fraud, bribery, and corruption. Operating independently, the SFO combines the functions of police and prosecutor to tackle high-level economic crimes affecting the United Kingdom.