Management, Scientific, and Technical Consulting Services Industry
type: Class
alternative label: 技术咨询行业
subclass of: RBFLYkta0F7DwegW1FnUX52
hidden label: TCHC
definition: This industry group comprises establishments primarily engaged in providing advice and assistance to businesses and other organizations on management, environmental, scientific, and technical issues.