Co-Authoring Management
type: Class
subclass of: RCOOyyZhW3l3cdenBfC5LT4
definition: Co-Authoring Management refers to the process of managing the collaboration and contribution of multiple authors to a document, within the context of Document Management.