Objection to Application for Professional Employment
type: Class
alternative label: 反对职业就业申请
subclass of: RxqbetYhPzqR3tJ4vtTbi8
definition: An objection made specifically in response to an application for professional employment.