Intrusion
type: Class
alternative label: 入侵
subclass of: Rd7uelGFqCTWSgf9lWki5N
definition: The concept of Intrusion refers to a type of privacy claim that involves intentional and offensive interference with an individual's solitude or private affairs, which would be highly offensive to a reasonable person.