Admiralty Court
type: Class
subclass of: R9sbuHkJC9aqDlHAgw58VSB
definition: Admiralty Court refers to a specialized court that has jurisdiction over maritime disputes and offenses, including those related to shipping, navigation, and marine commerce.