New York City - Municipal Court
type: Class
subclass of: R3391bdB1A2adE51071C7cf7
definition: New York City Municipal Court is a court of limited jurisdiction that hears cases involving minor criminal offenses, civil cases involving amounts up to $25,000, and small claims cases involving amounts up to $5,000 in New York City.