Objection to Professional Fees
type: Class
alternative label: 对专业费用的反对
subclass of: RxqbetYhPzqR3tJ4vtTbi8
definition: An objection raised by a party to challenge the amount or reasonableness of fees charged by a professional for services rendered.