Non-metallic Mineral Rights
type: Class
subclass of: R9jGsr6LEcgGQxDRMlckOMm
definition: These pertain to the ownership and extraction of non-metallic minerals, such as coal, limestone, and gravel, from specific plots of land. As with metallic minerals, these rights can be leased, sold, or transferred.