Civil Rights
type: Class
subclass of: R0TZk2qCI4HPwDl3e9FoOo
definition: Civil rights are the rights of individuals to receive equal treatment and protection under the law, typically focusing on issues such as discrimination, freedom of speech, and the right to vote. These rights are enshrined in national laws and constitutions and are designed to protect individuals from unfair treatment or discrimination by the government or private organizations