Texas District Court - Wood County
type: Class
subclass of: RDvQuaxSojEqV7COK0FlBTI
definition: Texas District Court - Wood County: A court of law in Texas that has jurisdiction over legal cases within Wood County.