Chapter 15 Service List
type: Class
alternative label: 第15章服务清单
subclass of: R8zijLH2GH0SxOhIdzeDOs3
definition: A Chapter 15 Service List is a specific type of document related to bankruptcy and restructuring proceedings that contains a list of parties who have been served with notice of the proceedings.