Consideration
type: Class
alternative label: 对价
subclass of: RDRCaFxX4hpUklgNnVS9D8C
definition: Consideration refers to the value given in exchange for a promise or performance in a legal contract, often involving the transfer of money, property, or services.
source: ABA M&A Deal Points Study