Tax Invoice Client Name
type: Class
alternative label: 税务发票客户名称
subclass of: RoYTC8fQGfAAw076QxHUOA
definition: A tax invoice client name is a specific detail included in a fee invoice that identifies the client for whom legal services were provided and for which taxes are being invoiced.