Arizona Superior Court - Mohave Cty.
type: Class
subclass of: R30265408Cb3d04Ed2b2957b
definition: Arizona Superior Court - Mohave Cty. is a specific court located in Mohave County, Arizona that operates under the jurisdiction of the Arizona Superior Court.