New York District Court - Suffolk County - 1st District
type: Class
subclass of: R7aBbOhIQLuwrLOympuadoq
definition: A court located in Suffolk County, New York that is part of the larger New York District Court system.