Adultery
type: Class
alternative label: 通奸
subclass of: R7widavYhXmyfw9WvR9ahBs
definition: Voluntary sexual intercourse between a married person and someone who is not their spouse, which is considered as a ground for divorce.