Data Architecture Management
type: Class
alternative label: Data Extraction Management
subclass of: RDrgrPYJPo0Rj0YG5xJ2OMX
definition: Data Architecture Management involves organizing the data extraction, planning, design, and implementation of policies, structures, and processes that govern the organization, storage, and accessibility of data within an enterprise, ensuring data integrity, consistency, and efficient use across various applications and systems.