Car Renter Liable for Injury
type: Class
alternative label: 租车人对伤害负责
subclass of: R8alUnZrt8GVEzHYhh1KTva
subclass of: RDSBerlLWg1ntpLqDQn1eVn
definition: A legal principle that holds a person who rents a car responsible for any injuries or damages caused by the car while it is in their possession.