Web Search Portals, Libraries, Archives, and Other Information Industry
type: Class
alternative label: INTE
subclass of: RHwCmZ2yKrJobzC86GC6Ep
hidden label: INTE
definition: Industries in the Web Search Portals, Libraries, Archives, and Other Information Services subsector group establishments supplying information, storing and providing access to information, searching and retrieving information, and operating Web sites that use search engines to allow for searching information on the Internet. The main components of the subsector are libraries, archives, and Web search portals.