Nursing Malpractice
type: Class
alternative label: 护理过失
subclass of: R8nVhrBlasGIc7jxw1D0vbm
definition: Nursing Malpractice refers to a legal claim against a nurse for failing to provide the appropriate standard of care, resulting in harm or injury to a patient.