Affiliate Agreement
type: Class
alternative label: 联盟协议
subclass of: R88D8i8AcSTUig2X3yPbFHg
definition: An affiliate agreement is a legally binding contract between two parties, where one party agrees to promote or sell the products or services of the other party in exchange for a commission or other compensation.