Banda languages
type: Class
alternative label: 班达语系
subclass of: RDOvAHsvY8TKJ1O1orXPM9o
definition: The Banda languages are a group of structured systems of communication that consist of grammar and vocabulary, and are a subset of the larger category of languages.