Corsican
type: Class
alternative label: 科西嘉语
subclass of: RDOvAHsvY8TKJ1O1orXPM9o
definition: Corsican (Language) is a structured system of communication that consists of grammar and vocabulary, and is spoken in Corsica and parts of Italy.