Contact Name Suffix - IV (Fourth)
type: Class
preferred label: IV
alternative label: The Fourth
subclass of: RCOYxInIdB2hOEl2dAlgQQH
definition: The suffix "IV" stands for "Fourth" and is used after a person's full name to indicate that they are the fourth generation in their family to bear that name. This suffix is used to differentiate among family members in formal, legal, or financial contexts.