Indiana Superior Court - Johnson County
type: Class
subclass of: R7uq2Mq8qLUybQoDhVczzZ5
definition: Indiana Superior Court - Johnson County: A court of general jurisdiction in Indiana that hears civil and criminal cases within Johnson County.