04_1 Civil Rights (PACER NoS)
type: Class
subclass of: RCSGywkPBv7f2ACrfTSiirV
definition: 04_1 Civil Rights (PACER NoS) refers to a specific category of civil rights cases in the PACER system, including cases related to employment, voting, disabilities, education, housing, and other civil rights issues.