Application for Administrative Expenses
type: Class
alternative label: 行政费用申请
subclass of: RtSJkLiGzcKx8PVlCAB5q5
definition: An Application for Administrative Expenses is a request made in a bankruptcy case for reimbursement of expenses incurred in administering the bankruptcy estate, such as fees for attorneys or accountants.