Empty Chair
type: Class
alternative label: 空椅子
subclass of: RCzs34uEQI9f4cuWp3bQO0P
definition: The Empty Chair is a legal defense strategy in civil litigation where the defendant is absent from the trial and is not represented by counsel.