Bosnian
type: Class
alternative label: 波斯尼亚语
subclass of: RDOvAHsvY8TKJ1O1orXPM9o
definition: Bosnian (Language) is a structured system of communication consisting of grammar and vocabulary used in Bosnia and Herzegovina and other regions, and is a subcategory of the Language class.