Governmental Body
type: Class
alternative label: 政府机构
subclass of: Thing
definition: Administrative entities of government or state agency or appointed commission, as a permanent or semi-permanent governmental organization that oversees or administers specific governmental functions.